Reaction Details
TargetNeprilysin
LigandBDBM298293
Substrate/Competitorn/a
Meas. Tech.Enzyme NEP Inhibition Assay
Ki<1.000±n/a nM
Citation Hughes, ADFenster, EFleury, MGendron, RMoran, EJ Neprilysin inhibitors US Patent US10123984 Publication Date 11/13/2018
 
Neprilysin
Name:Neprilysin
Type:Enzyme
Mol. Mass.:85505.38
Organism:Homo sapiens (Human)
Description:P08473
Residue:750
BDBM298293
NameBDBM298293
Synonyms:US10123984, Example 2U US11547687, Example 2U | US20230285340, Example 2U
TypeSmall organic molecule
Emp. Form.C27H26ClNO7
Mol. Mass.511.951
SMILESO[C@H](C[C@@H](Cc1ccc(cc1)-c1cccc(Cl)c1)NC(=O)C(=O)OCCOc1ccccc1)C(O)=O