Reaction Details
TargetNeprilysin
LigandBDBM298300
Substrate/Competitorn/a
Meas. Tech.Enzyme NEP Inhibition Assay
Ki<1.000±n/a nM
Citation Hughes, ADFenster, EFleury, MGendron, RMoran, EJ Neprilysin inhibitors US Patent US10123984 Publication Date 11/13/2018
 
Neprilysin
Name:Neprilysin
Type:Enzyme
Mol. Mass.:85505.38
Organism:Homo sapiens (Human)
Description:P08473
Residue:750
BDBM298300
NameBDBM298300
Synonyms:US10123984, Example 5-9 | US20230285340, Example 5-9
TypeSmall organic molecule
Emp. Form.C19H17Cl2NO6
Mol. Mass.426.247
SMILESOC(CC(Cc1ccc(c(Cl)c1)-c1cccc(Cl)c1)NC(=O)C(O)=O)C(O)=O