Reaction Details
TargetNeprilysin
LigandBDBM298316
Substrate/Competitorn/a
Meas. Tech.Enzyme NEP Inhibition Assay
Ki 3.55±n/a nM
Citation Hughes, ADFenster, EFleury, MGendron, RMoran, EJ Neprilysin inhibitors US Patent US10123984 Publication Date 11/13/2018
 
Neprilysin
Name:Neprilysin
Type:Enzyme
Mol. Mass.:85505.38
Organism:Homo sapiens (Human)
Description:P08473
Residue:750
BDBM298316
NameBDBM298316
Synonyms:US10123984, Example 11-1 US20230285340, Example 11-1
TypeSmall organic molecule
Emp. Form.C21H22FNO6
Mol. Mass.403.4009
SMILESC[C@@](CO)(C[C@@H](Cc1ccc(cc1)-c1ccccc1F)NC(=O)C(O)=O)C(O)=O