Reaction Details
TargetNeprilysin
LigandBDBM298327
Substrate/Competitorn/a
Meas. Tech.Enzyme NEP Inhibition Assay
Ki 6.31±0 nM
Citation Hughes, ADFenster, EFleury, MGendron, RMoran, EJ Neprilysin inhibitors US Patent US10123984 Publication Date 11/13/2018
 
Neprilysin
Name:Neprilysin
Type:Enzyme
Mol. Mass.:85505.38
Organism:Homo sapiens (Human)
Description:P08473
Residue:750
BDBM298327
NameBDBM298327
Synonyms:US10123984, Comparative Compound A
TypeSmall organic molecule
Emp. Form.C19H19NO5
Mol. Mass.341.3579
SMILESC[C@H](C[C@H](NC(=O)C(O)=O)c1ccc(cc1)-c1ccccc1)C(O)=O