Reaction Details
TargetPlatelet-derived growth factor receptor beta
LigandBDBM445209
Substrate/Competitorn/a
Meas. Tech.PDGFR beta Enzyme Inhibition
Ki 8.00±n/a nM
Citation Walters, IBirch, LCollingwood, SPStevenson, CS Indole derivatives and their use as protein kinase inhibitors US Patent US10669235 Publication Date 6/2/2020
 
Platelet-derived growth factor receptor beta
Name:Platelet-derived growth factor receptor beta
Type:Enzyme
Mol. Mass.:123922.25
Organism:Homo sapiens (Human)
Description:P09619
Residue:1106
BDBM445209
NameBDBM445209
Synonyms:US10669235, Nintedanib
TypeSmall organic molecule
Emp. Form.C31H33N5O4
Mol. Mass.539.6248
SMILESCOC(=O)c1ccc2c(C(=Nc3ccc(cc3)N(C)C(=O)CN3CCN(C)CC3)c3ccccc3)c(O)[nH]c2c1