Reaction Details
TargetPlatelet-derived growth factor receptor beta
LigandBDBM445218
Substrate/Competitorn/a
Meas. Tech.PDGFR beta Enzyme Inhibition
Ki 7.89±n/a nM
Citation Walters, IBirch, LCollingwood, SPStevenson, CS Indole derivatives and their use as protein kinase inhibitors US Patent US10669235 Publication Date 6/2/2020
 
Platelet-derived growth factor receptor beta
Name:Platelet-derived growth factor receptor beta
Type:Enzyme
Mol. Mass.:123922.25
Organism:Homo sapiens (Human)
Description:P09619
Residue:1106
BDBM445218
NameBDBM445218
Synonyms:US10669235, Example 9 | US11208381, Example 9
TypeSmall organic molecule
Emp. Form.C31H31N5O5
Mol. Mass.553.6083
SMILESCOC(=O)c1cc2NC(=O)\C(=C(/Nc3ccc(cc3)C(=O)NCCN3CCNC(=O)C3)c3ccccc3)c2cc1C