Reaction Details
TargetPlatelet-derived growth factor receptor beta
LigandBDBM445224
Substrate/Competitorn/a
Meas. Tech.PDGFR beta Enzyme Inhibition
Ki 5.00±n/a nM
Citation Walters, IBirch, LCollingwood, SPStevenson, CS Indole derivatives and their use as protein kinase inhibitors US Patent US10669235 Publication Date 6/2/2020
 
Platelet-derived growth factor receptor beta
Name:Platelet-derived growth factor receptor beta
Type:Enzyme
Mol. Mass.:123922.25
Organism:Homo sapiens (Human)
Description:P09619
Residue:1106
BDBM445224
NameBDBM445224
Synonyms:US10669235, Example 15
TypeSmall organic molecule
Emp. Form.C33H35N5O6
Mol. Mass.597.6609
SMILESCOC(=O)c1cc2NC(=O)\C(=C(/Nc3ccc(cc3)C(=O)N3CCN(CC(=O)NCCO)CC3)c3ccccc3)c2cc1C