Reaction Details
TargetFibroblast growth factor receptor 3
LigandBDBM445228
Substrate/Competitorn/a
Meas. Tech.FGFR3 Enzyme Inhibition
Ki 9.04±n/a nM
Citation Walters, IBirch, LCollingwood, SPStevenson, CS Indole derivatives and their use as protein kinase inhibitors US Patent US10669235 Publication Date 6/2/2020
 
Fibroblast growth factor receptor 3
Name:Fibroblast growth factor receptor 3
Type:Protein
Mol. Mass.:87699.57
Organism:Homo sapiens (Human)
Description:P22607
Residue:806
BDBM445228
NameBDBM445228
Synonyms:US10669235, Example 19 | US11208381, Example 19
TypeSmall organic molecule
Emp. Form.C31H32N4O5
Mol. Mass.540.6096
SMILESCOC(=O)c1cc2NC(=O)\C(=C(/Nc3ccc(cc3)C(=O)N3CCN(CCO)CC3)c3ccccc3)c2cc1C