Reaction Details
TargetPlatelet-derived growth factor receptor beta
LigandBDBM445246
Substrate/Competitorn/a
Meas. Tech.PDGFR beta Enzyme Inhibition
Ki 7.54±n/a nM
Citation Walters, IBirch, LCollingwood, SPStevenson, CS Indole derivatives and their use as protein kinase inhibitors US Patent US10669235 Publication Date 6/2/2020
 
Platelet-derived growth factor receptor beta
Name:Platelet-derived growth factor receptor beta
Type:Enzyme
Mol. Mass.:123922.25
Organism:Homo sapiens (Human)
Description:P09619
Residue:1106
BDBM445246
NameBDBM445246
Synonyms:US10669235, Example 37 | US11208381, Example 37
TypeSmall organic molecule
Emp. Form.C35H38N4O5
Mol. Mass.594.7
SMILESCOC(=O)c1cc2NC(=O)\C(=C(/Nc3ccc(cc3)C(=O)N3CCC(O)(CN4CCCC4)CC3)c3ccccc3)c2cc1C