Reaction Details
TargetSomatostatin receptor type 4
LigandBDBM312012
Substrate/Competitorn/a
Meas. Tech.cAMP ASSAY
EC50 1.10±n/a nM
Citation Giovannini, RCui, YDoods, HFerrara, MJust, SKuelzer, RLingard, IMazzaferro, RRudolf, K Somatostatin receptor subtype 4 (SSTR4) agonists US Patent US10675268 Publication Date 6/9/2020
 
Somatostatin receptor type 4
Name:Somatostatin receptor type 4
Type:Enzyme
Mol. Mass.:42015.38
Organism:Homo sapiens (Human)
Description:P31391
Residue:388
BDBM312012
NameBDBM312012
Synonyms:US10166214, Example 148 US9789082, Example 148
TypeSmall organic molecule
Emp. Form.C19H24N4O
Mol. Mass.324.4201
SMILESCc1nc(c2cccc(C)c2n1)C(C)(C)NC(=O)[C@@H]1[C@H]2CNC[C@@H]12