Reaction Details
TargetAryl hydrocarbon receptor
LigandBDBM50049061
Substrate/Competitorn/a
Meas. Tech.ethoxyresorufin-O-deethylase (EROD) assay
EC50 55.0±30 nM
Citation Tang, WLi, XShu, DWinston-McPherson, GN Synthesis of diindolylmethanes and indolo[3,2-b]carbazoles, compounds formed thereby, and pharmaceutical compositions containing them US Patent US10730833 Publication Date 8/4/2020
 
Aryl hydrocarbon receptor
Name:Aryl hydrocarbon receptor
Type:PROTEIN
Mol. Mass.:96143.77
Organism:Homo sapiens (Human)
Description:ChEMBL_1503828
Residue:848
BDBM50049061
NameBDBM50049061
Synonyms:CHEMBL3319501 US9969686, Compound 11d
TypeSmall organic molecule
Emp. Form.C19H16N2O
Mol. Mass.288.3431
SMILESCn1cc(Cc2[nH]c3ccccc3c2C=O)c2ccccc12