Reaction Details
TargetLysine-specific histone demethylase 1A
LigandBDBM456500
Substrate/Competitorn/a
Meas. Tech.Inhibitory Activity Assay
IC50 0.110±n/a nM
Citation Yamashita, SOgawa, TKomatani, H Biphenyl compound or salt thereof US Patent US10723742 Publication Date 7/28/2020
 
Lysine-specific histone demethylase 1A
Name:Lysine-specific histone demethylase 1A
Type:Enzyme
Mol. Mass.:92901.01
Organism:Homo sapiens (Human)
Description:O60341
Residue:852
BDBM456500
NameBDBM456500
Synonyms:US10723742, Example 228 US11510915, Example 241
TypeSmall organic molecule
Emp. Form.C31H30F2N6O2
Mol. Mass.556.6057
SMILESCc1c(F)c(cc2nnn(CC(C)(C)O)c12)-c1ccc(cc1-c1ccc(C#N)c(F)c1)C(=O)N1[C@@H]2CC[C@H]1[C@@H](N)C2