Reaction Details
TargetLysine-specific histone demethylase 1A
LigandBDBM456528
Substrate/Competitorn/a
Meas. Tech.Inhibitory Activity Assay
IC50 0.120±n/a nM
Citation Yamashita, SOgawa, TKomatani, H Biphenyl compound or salt thereof US Patent US10723742 Publication Date 7/28/2020
 
Lysine-specific histone demethylase 1A
Name:Lysine-specific histone demethylase 1A
Type:Enzyme
Mol. Mass.:92901.01
Organism:Homo sapiens (Human)
Description:O60341
Residue:852
BDBM456528
NameBDBM456528
Synonyms:US10723742, Example 257 US11510915, Example 269
TypeSmall organic molecule
Emp. Form.C31H27ClF2N6O2
Mol. Mass.589.035
SMILESN[C@H]1C[C@H]2CC[C@@H]1N2C(=O)c1ccc(-c2cc3nnn(CC4(O)CCC4)c3c(Cl)c2F)c(c1)-c1ccc(C#N)c(F)c1