Reaction Details
TargetHistone deacetylase 8
LigandBDBM103537
Substrate/Competitorn/a
IC50 336±n/a nM
Citation Chen, DSong, HYSun, ETYu, NZou, Y Benzimidazole derivatives: preparation and pharmaceutical applications US Patent US10736881 Publication Date 8/11/2020
 
Histone deacetylase 8
Name:Histone deacetylase 8
Type:Enzyme
Mol. Mass.:41749.60
Organism:Homo sapiens (Human)
Description:Q9BY41
Residue:377
BDBM103537
NameBDBM103537
Synonyms:US10201527, Compound 7 US8551988, 7
TypeSmall organic molecule
Emp. Form.C27H27N3O6
Mol. Mass.489.5198
SMILESCOc1cc(ccc1OCc1ccccc1)-c1nc2cc(\C=C\C(=O)NO)ccc2n1CC(O)CO