Reaction Details
TargetNeprilysin
LigandBDBM298308
Substrate/Competitorn/a
Meas. Tech.Enzyme Inhibition Assay
Ki<1.000±n/a nM
Citation Hughes, ADFenster, EFleury, MGendron, RMoran, EJ Neprilysin inhibitors US Patent US10744104 Publication Date 8/18/2020
 
Neprilysin
Name:Neprilysin
Type:Enzyme
Mol. Mass.:85505.38
Organism:Homo sapiens (Human)
Description:P08473
Residue:750
BDBM298308
NameBDBM298308
Synonyms:US10123984, Example 8-3 US20230285340, Example 8-3
TypeSmall organic molecule
Emp. Form.C20H20ClNO6
Mol. Mass.405.829
SMILESOCC(CC(Cc1ccc(cc1)-c1ccccc1Cl)NC(=O)C(O)=O)C(O)=O