Reaction Details
TargetNitric oxide synthase, brain
LigandBDBM50014716
Substrate/Competitorn/a
Meas. Tech.Enzyme Inhibition Assay
Ki 70.0±4 nM
Citation Silverman, RBWang, HQin, YZou, FKang, SSJing, Q Mammalian and bacterial nitric oxide synthase inhibitors US Patent US10759791 Publication Date 9/1/2020
 
Nitric oxide synthase, brain
Name:Nitric oxide synthase, brain
Type:Enzyme
Mol. Mass.:160570.98
Organism:Rattus norvegicus (rat)
Description:Recombinant nNOS overexpressed in E. coli was used in enzyme assays.
Residue:1429
BDBM50014716
NameBDBM50014716
Synonyms:CHEMBL3262025 US9951014, Name 8S
TypeSmall organic molecule
Emp. Form.C22H28N6
Mol. Mass.376.4979
SMILESCc1cc(N)nc(CCc2cncc(c2)[C@@H](CN)Cc2cc(C)cc(N)n2)c1