Reaction Details
TargetAcetyl-CoA carboxylase 1
LigandBDBM459202
Substrate/Competitorn/a
Meas. Tech.Kinase Assay
IC50 1.76±n/a nM
Citation Tang, WYang, XGu, ZLi, CZhang, ZWan, ZWang, XZhang, Y Thienopyrimidine derivative and use thereof in medicine US Patent US10759812 Publication Date 9/1/2020
 
Acetyl-CoA carboxylase 1
Name:Acetyl-CoA carboxylase 1
Type:Protein
Mol. Mass.:265543.22
Organism:Homo sapiens (Human)
Description:Q13085
Residue:2346
BDBM459202
NameBDBM459202
Synonyms:2-[1-[2-(3,3a,4,5,6,6a-hexahydro-1H-cyclopenteno[c]furan5-oxy)-2-(2-methoxyphenyl)ethyl)-5-methyl-6-oxazol-2-yl-2,4-dioxo-thieno[2,3-d]pyrimid-3-yl]-2-methyl-propanoic acid | US10759812, Example 13
TypeSmall organic molecule
Emp. Form.C30H33N3O8S
Mol. Mass.595.663
SMILESCOc1ccccc1C(Cn1c2sc(c(C)c2c(=O)n(c1=O)C(C)(C)C(O)=O)-c1ncco1)OC1CC2COCC2C1