Reaction Details
TargetAcetyl-CoA carboxylase 1
LigandBDBM459208
Substrate/Competitorn/a
Meas. Tech.Kinase Assay
IC50 0.880±n/a nM
Citation Tang, WYang, XGu, ZLi, CZhang, ZWan, ZWang, XZhang, Y Thienopyrimidine derivative and use thereof in medicine US Patent US10759812 Publication Date 9/1/2020
 
Acetyl-CoA carboxylase 1
Name:Acetyl-CoA carboxylase 1
Type:Protein
Mol. Mass.:265543.22
Organism:Homo sapiens (Human)
Description:Q13085
Residue:2346
BDBM459208
NameBDBM459208
Synonyms:2-[1-[2-[[(3aR,6aS)-5-ethyl-5-hydroxy-2,3,3a,4,6,6a-hexahydro-1H-pentalen-2-yl]oxy]-2-(2-methoxyphenyl)ethyl)-5-methyl-6-oxazol-2-yl-2,4-dioxo-thieno[2,3-d]pyrimid-3-yl]-2-methyl-propanoic acid | US10759812, Example 19
TypeSmall organic molecule
Emp. Form.C33H39N3O8S
Mol. Mass.637.743
SMILESCCC1(O)C[C@@H]2C[C@@H](C[C@@H]2C1)OC(Cn1c2sc(c(C)c2c(=O)n(c1=O)C(C)(C)C(O)=O)-c1ncco1)c1ccccc1OC