Reaction Details
TargetAcetyl-CoA carboxylase 1
LigandBDBM459209
Substrate/Competitorn/a
Meas. Tech.Kinase Assay
IC50 1.43±n/a nM
Citation Tang, WYang, XGu, ZLi, CZhang, ZWan, ZWang, XZhang, Y Thienopyrimidine derivative and use thereof in medicine US Patent US10759812 Publication Date 9/1/2020
 
Acetyl-CoA carboxylase 1
Name:Acetyl-CoA carboxylase 1
Type:Protein
Mol. Mass.:265543.22
Organism:Homo sapiens (Human)
Description:Q13085
Residue:2346
BDBM459209
NameBDBM459209
Synonyms:2-[1-[2-[[(3aR,6aS)-5,5-difluoro-2,3,3a,4,6,6a-hexahydro-1H-pentalen-2-yl]oxy]-2-(2-methoxyphenyl)ethyl)-5-methyl-6-oxazol-2-yl-2,4-dioxo-thieno[2,3-d]pyrimid-3-yl]-2-methyl-propanoic acid | US10759812, Example 21
TypeSmall organic molecule
Emp. Form.C31H33F2N3O7S
Mol. Mass.629.671
SMILESCOc1ccccc1C(Cn1c2sc(c(C)c2c(=O)n(c1=O)C(C)(C)C(O)=O)-c1ncco1)O[C@H]1C[C@H]2CC(F)(F)C[C@H]2C1