Reaction Details
TargetAcetyl-CoA carboxylase 2
LigandBDBM459214
Substrate/Competitorn/a
Meas. Tech.Kinase Assay
IC50 2.19±n/a nM
Citation Tang, WYang, XGu, ZLi, CZhang, ZWan, ZWang, XZhang, Y Thienopyrimidine derivative and use thereof in medicine US Patent US10759812 Publication Date 9/1/2020
 
Acetyl-CoA carboxylase 2
Name:Acetyl-CoA carboxylase 2
Type:Protein
Mol. Mass.:276535.21
Organism:Homo sapiens (Human)
Description:O00763
Residue:2458
BDBM459214
NameBDBM459214
Synonyms:2-[1-[2-[[(3aR,6aS)-5-methylsulfonyl-1,2,3,3a,4,5,6,6a-octahydropentalen-2-yl]oxy]-2-(2-methoxyphenyl)ethyl]-5-methyl-6-oxazol-2-yl-2,4-dioxo-thieno[2,3-d]pyrimid-3-yl]-2-methyl-propanoic acid | US10759812, Example 29
TypeSmall organic molecule
Emp. Form.C32H37N3O9S2
Mol. Mass.671.781
SMILESCOc1ccccc1C(Cn1c2sc(c(C)c2c(=O)n(c1=O)C(C)(C)C(O)=O)-c1ncco1)O[C@H]1C[C@H]2C[C@@H](C[C@H]2C1)S(C)(=O)=O