Reaction Details
TargetAcetyl-CoA carboxylase 1
LigandBDBM459215
Substrate/Competitorn/a
Meas. Tech.Kinase Assay
IC50 1.21±n/a nM
Citation Tang, WYang, XGu, ZLi, CZhang, ZWan, ZWang, XZhang, Y Thienopyrimidine derivative and use thereof in medicine US Patent US10759812 Publication Date 9/1/2020
 
Acetyl-CoA carboxylase 1
Name:Acetyl-CoA carboxylase 1
Type:Protein
Mol. Mass.:265543.22
Organism:Homo sapiens (Human)
Description:Q13085
Residue:2346
BDBM459215
NameBDBM459215
Synonyms:2-[1-[2-[[(1S,3S,5R)-6,8-dioxabicyclo[3.2.1]oct-3-yl]oxy]-2-(2-methoxyphenyl)-5-methyl-6-oxazol-2-yl-2,4-dioxo-thieno[2,3-d]pyrimid-3-yl]-2-methyl-propanoic acid | US10759812, Example 32
TypeSmall organic molecule
Emp. Form.C29H31N3O9S
Mol. Mass.597.636
SMILESCOc1ccccc1C(Cn1c2sc(c(C)c2c(=O)n(c1=O)C(C)(C)C(O)=O)-c1ncco1)O[C@H]1C[C@H]2CO[C@@H](C1)O2