Reaction Details
TargetMitogen-activated protein kinase kinase kinase kinase 4
LigandBDBM299383
Substrate/Competitorn/a
Meas. Tech.MAP4K4 Inhibition Assay
IC50 19.7±n/a nM
Citation Chen, HCrawford, THarris, SFMagnuson, SRNdubaku, CWang, L Aminoquinazoline and pyridopyrimidine derivatives US Patent US9592235 Publication Date 3/14/2017
 
Mitogen-activated protein kinase kinase kinase kinase 4
Name:Mitogen-activated protein kinase kinase kinase kinase 4
Type:Serine/threonine-protein kinase
Mol. Mass.:142114.73
Organism:Homo sapiens (Human)
Description:O95819
Residue:1239
BDBM299383
NameBDBM299383
Synonyms:6-(3-chloro- phenyl)pyrido [3,2-d] pyrimidin-4- amine US9855269, Compound 25
TypeSmall organic molecule
Emp. Form.C13H9ClN4
Mol. Mass.256.69
SMILESNc1ncnc2ccc(nc12)-c1cccc(Cl)c1