Reaction Details
TargetP2X purinoceptor 7
LigandBDBM242069
Substrate/Competitorn/a
Meas. Tech.Binding Assay
IC50 0.65±n/a nM
Citation Kilburn, JPRasmussen, LKJessing, MEldemenky, EMChen, BJiang, Y Cyclic amines US Patent US9593105 Publication Date 3/14/2017
 
P2X purinoceptor 7
Name:P2X purinoceptor 7
Type:Protein
Mol. Mass.:68602.85
Organism:Homo sapiens (Human)
Description:Q99572
Residue:595
BDBM242069
NameBDBM242069
Synonyms:US9415055, 2,3-dichloro-N-[2-(4,4-difluoro-1-piperidyl)-2-[2-(trifluoromethyl)pyrimidin-5-yl]ethyl]benzamide | US9593105, 70
TypeSmall organic molecule
Emp. Form.C19H17Cl2F5N4O
Mol. Mass.483.262
SMILESFC(F)(F)c1ncc(cn1)C(CNC(=O)c1cccc(Cl)c1Cl)N1CCC(F)(F)CC1