Reaction Details
TargetNeprilysin
LigandBDBM300276
Substrate/Competitorn/a
Meas. Tech.Enzyme Inhibition Assay
Ki<1.00±n/a nM
Citation Fleury, MBeausoliel, AHughes, ADLong, DDWilton, DA Neprilysin inhibitors US Patent US9593110 Publication Date 3/14/2017
 
Neprilysin
Name:Neprilysin
Type:Enzyme
Mol. Mass.:85505.38
Organism:Homo sapiens (Human)
Description:P08473
Residue:750
BDBM300276
NameBDBM300276
Synonyms:US9593110, 18-10
TypeSmall Organic Molecule
Emp. Form.C24H22Cl2FN3O4
Mol. Mass.506.354
SMILESN[C@@H](C[C@@H](Cc1ccc(cc1Cl)-c1cc(Cl)ccc1F)NC(=O)c1cc(on1)C1CC1)C(O)=O