Reaction Details
TargetMonoacylglycerol lipase ABHD6
LigandBDBM280567
Substrate/Competitorn/a
Meas. Tech.In Vitro Competitive Activity-Based Protein Profiling Assay
IC50>1000±n/a nM
Citation Buzard, DJShaghafi, MBCisar, JSGrice, CAJones, TKWeber, OD Spirocycle compounds and methods of making and using same US Patent US10781211 Publication Date 9/22/2020
 
Monoacylglycerol lipase ABHD6
Name:Monoacylglycerol lipase ABHD6
Type:Single-pass type II membrane protein; hydrolase
Mol. Mass.:38216.17
Organism:Mus musculus (mouse)
Description:Assays were using membranes of recombinant Abh6 transiently transfected in COS-7 cells.
Residue:336
BDBM280567
NameBDBM280567
Synonyms:US10030020, Example 112 | US10781211, Example 112
TypeSmall organic molecule
Emp. Form.C25H30ClF6N3O3
Mol. Mass.569.967
SMILESFC(F)(F)C(OC(=O)N1CCC2(CCCN2Cc2cccc(N3CC4COCC4C3)c2Cl)CC1)C(F)(F)F