Reaction Details
TargetKetohexokinase
LigandBDBM319582
Substrate/Competitorn/a
Meas. Tech.Biological Assay
IC50 3.30±n/a nM
Citation Dowling, MFernando, DFutatsugi, KHuard, KMagee, TVRaymer, BShavnya, ASmith, AThuma, BTsai, ATu, M Substituted 3-azabicyclo[3.1.0]hexanes as ketohexokinase inhibitors US Patent US10787438 Publication Date 9/29/2020
 
Ketohexokinase
Name:Ketohexokinase
Type:Enzyme Catalytic Domain
Mol. Mass.:32521.64
Organism:Homo sapiens (Human)
Description:n/a
Residue:298
BDBM319582
NameBDBM319582
Synonyms:US10174007, Example 1 US10988463, Example 1 | US11634410, Example 1
TypeSmall organic molecule
Emp. Form.C18H19F3N4O3
Mol. Mass.396.3637
SMILESC[C@H]1[C@H](O)CN1c1nc(cc(c1C#N)C(F)(F)F)N1C[C@H]2[C@H](CC(O)=O)[C@H]2C1