Reaction Details
TargetBile acid receptor
LigandBDBM465538
Substrate/Competitorn/a
Meas. Tech.Binding Assay
EC50 0.631±n/a nM
Citation Chao, JJain, RHu, LLewis, JGBaribault, HCaldwell, J Hormone receptor modulators for treating metabolic conditions and disorders US Patent US10793568 Publication Date 10/6/2020
 
Bile acid receptor
Name:Bile acid receptor
Type:Nuclear Receptor
Mol. Mass.:55916.24
Organism:Homo sapiens (Human)
Description:Q96RI1
Residue:486
BDBM465538
NameBDBM465538
Synonyms:US10793568, Compound I-187
TypeSmall organic molecule
Emp. Form.C32H36Cl2N4O5S
Mol. Mass.659.623
SMILESCN1CCC(CC1)S(=O)(=O)NC(=O)c1ccc(cc1)N1C[C@@H]2C[C@H]1C[C@H]2OCc1c(onc1-c1c(Cl)cccc1Cl)C1CC1