Reaction Details
TargetBile acid receptor
LigandBDBM465575
Substrate/Competitorn/a
Meas. Tech.Binding Assay
EC50 0.316±n/a nM
Citation Chao, JJain, RHu, LLewis, JGBaribault, HCaldwell, J Hormone receptor modulators for treating metabolic conditions and disorders US Patent US10793568 Publication Date 10/6/2020
 
Bile acid receptor
Name:Bile acid receptor
Type:Nuclear Receptor
Mol. Mass.:55916.24
Organism:Homo sapiens (Human)
Description:Q96RI1
Residue:486
BDBM465575
NameBDBM465575
Synonyms:US10793568, Compound I-225
TypeSmall organic molecule
Emp. Form.C39H49Cl2FN4O7S
Mol. Mass.807.798
SMILESCOCC(=O)NCCCCCCCCCCS(=O)(=O)NC(=O)c1ccc(N2C[C@@H]3C[C@H]2C[C@H]3OCc2c(onc2-c2c(Cl)cccc2Cl)C2CC2)c(F)c1