Reaction Details
TargetBile acid receptor
LigandBDBM465636
Substrate/Competitorn/a
Meas. Tech.Binding Assay
EC50 0.631±n/a nM
Citation Chao, JJain, RHu, LLewis, JGBaribault, HCaldwell, J Hormone receptor modulators for treating metabolic conditions and disorders US Patent US10793568 Publication Date 10/6/2020
 
Bile acid receptor
Name:Bile acid receptor
Type:Nuclear Receptor
Mol. Mass.:55916.24
Organism:Homo sapiens (Human)
Description:Q96RI1
Residue:486
BDBM465636
NameBDBM465636
Synonyms:US10793568, Compound I-287
TypeSmall organic molecule
Emp. Form.C27H22Cl2FN3O5S
Mol. Mass.590.45
SMILESOC(=O)c1cc(F)c2nc(sc2c1)N1C[C@@H]2C[C@H]1C[C@H]2OCc1c(onc1-c1c(Cl)cc(O)cc1Cl)C1CC1