Reaction Details
TargetSerine/threonine-protein kinase B-raf
LigandBDBM221684
Substrate/Competitorn/a
Meas. Tech.Amplified Luminescence Proximity Homogeneous Assay
IC50 0.200±n/a nM
Citation Huang, SJin, XLiu, ZPoon, DTellew, JWan, YWang, XXie, Y Compounds and compositions as protein kinase inhibitors US Patent US9593100 Publication Date 3/14/2017
 
Serine/threonine-protein kinase B-raf
Name:Serine/threonine-protein kinase B-raf
Type:Serine/threonine-protein kinase
Mol. Mass.:84446.00
Organism:Homo sapiens (Human)
Description:P15056
Residue:766
BDBM221684
NameBDBM221684
Synonyms:US10568884, Cpd 5 US9593100, Compound 5 | USRE49556, Compound 5
TypeSmall organic molecule
Emp. Form.C24H32ClN7O4S
Mol. Mass.550.073
SMILESCCCS(=O)(=O)Nc1cc(Cl)cc(c1)-c1nn(cc1-c1ccnc(NC[C@H](C)NC(=O)OC)n1)C(C)C