Reaction Details
TargetSerine/threonine-protein kinase B-raf
LigandBDBM221688
Substrate/Competitorn/a
Meas. Tech.Amplified Luminescence Proximity Homogeneous Assay
IC50 0.300±n/a nM
Citation Huang, SJin, XLiu, ZPoon, DTellew, JWan, YWang, XXie, Y Compounds and compositions as protein kinase inhibitors US Patent US9593100 Publication Date 3/14/2017
 
Serine/threonine-protein kinase B-raf
Name:Serine/threonine-protein kinase B-raf
Type:Serine/threonine-protein kinase
Mol. Mass.:84446.00
Organism:Homo sapiens (Human)
Description:P15056
Residue:766
BDBM221688
NameBDBM221688
Synonyms:US10568884, Cpd 9 US9593100, Compound 9 | USRE49556, Compound 9
TypeSmall organic molecule
Emp. Form.C22H27ClFN7O4S
Mol. Mass.540.011
SMILESCOC(=O)N[C@@H](C)CNc1nccc(n1)-c1cn(nc1-c1cc(Cl)cc(NS(C)(=O)=O)c1F)C(C)C