Reaction Details
TargetProto-oncogene tyrosine-protein kinase receptor Ret [V804M]
LigandBDBM311643
Substrate/Competitorn/a
Meas. Tech.Measurement of Inhibitory Activity Against RET (V804L, V804M)
IC50 1.30±n/a nM
Citation Miyazaki, IShimamura, TKato, MFujita, HIguchi, S Fused pyrimidine compound or salt thereof US Patent US10807986 Publication Date 10/20/2020
 
Proto-oncogene tyrosine-protein kinase receptor Ret [V804M]
Name:Proto-oncogene tyrosine-protein kinase receptor Ret [V804M]
Type:Enzyme Catalytic Domain
Mol. Mass.:124350.36
Organism:Homo sapiens (Human)
Description:P07949[V804M]
Residue:1114
BDBM311643
NameBDBM311643
Synonyms:Ex. Cpd. 95 US11046696, Compound 95
TypeSmall organic molecule
Emp. Form.C22H23N5O2
Mol. Mass.389.4503
SMILESCOCc1ccc(NC(=O)c2c(C#CC)n(c3ncnc(N)c23)C2(C)CC2)cc1