Reaction Details
TargetProto-oncogene tyrosine-protein kinase receptor Ret [V804L]
LigandBDBM311703
Substrate/Competitorn/a
Meas. Tech.Measurement of Inhibitory Activity Against RET (V804L, V804M)
IC50 0.500±n/a nM
Citation Miyazaki, IShimamura, TKato, MFujita, HIguchi, S Fused pyrimidine compound or salt thereof US Patent US10807986 Publication Date 10/20/2020
 
Proto-oncogene tyrosine-protein kinase receptor Ret [V804L]
Name:Proto-oncogene tyrosine-protein kinase receptor Ret [V804L]
Type:Enzyme Catalytic Domain
Mol. Mass.:124332.32
Organism:Homo sapiens (Human)
Description:P07949[V804L]
Residue:1114
BDBM311703
NameBDBM311703
Synonyms:Ex. Cpd. 155 US11046696, Compound 155
TypeSmall organic molecule
Emp. Form.C26H25N7O2
Mol. Mass.467.5224
SMILESCOCc1ccc(NC(=O)c2c(C#Cc3ccc(N)nc3)n(c3ncnc(N)c23)C2(C)CC2)cc1