Reaction Details
TargetSodium channel protein type 5 subunit alpha
LigandBDBM373956
Substrate/Competitorn/a
Meas. Tech.In Vitro Assay
IC50 23193±n/a nM
Citation Burford, KNChowdhury, SDehnhardt, CMFocken, TGrimwood, MEHasan, SA Benzenesulfonamide compounds and their use as therapeutic agents US Patent US10815229 Publication Date 10/27/2020
 
Sodium channel protein type 5 subunit alpha
Name:Sodium channel protein type 5 subunit alpha
Type:Enzyme
Mol. Mass.:226908.60
Organism:Homo sapiens (Human)
Description:Q14524
Residue:2016
BDBM373956
NameBDBM373956
Synonyms:4-((1-benzylpiperidin-4-yl)oxy)-2,6-difluoro-3-methyl-N-(thiazol-2-yl)benzenesulfonamide 2,2,2-trifluoroacetate US10815229, Example 223
TypeSmall organic molecule
Emp. Form.C22H23F2N3O3S2
Mol. Mass.479.563
SMILESCc1c(F)c(c(F)cc1OC1CCN(Cc2ccccc2)CC1)S(=O)(=O)Nc1nccs1