Reaction Details
TargetNADPH oxidase 1
LigandBDBM300362
Substrate/Competitorn/a
Meas. Tech.ROS Production Measurement on hNOX1 Membranes
Ki 62.0±n/a nM
Citation Machin, PSharpe, ALock, CJChambers, MSHodges, AAllen, VEllard, JM Amido thiadiazole derivatives as NADPH oxidase inhibitors US Patent US10130619 Publication Date 11/20/2018
 
NADPH oxidase 1
Name:NADPH oxidase 1
Type:PROTEIN
Mol. Mass.:64890.44
Organism:Homo sapiens (Human)
Description:ChEMBL_792877
Residue:564
BDBM300362
NameBDBM300362
Synonyms:US10130619, Example 24
TypeSmall organic molecule
Emp. Form.C25H25N7O2S
Mol. Mass.487.577
SMILESCN1CCN(CC1)c1cc(cnc1OCc1ccccc1)C(=O)Nc1nnc(s1)-c1ccncc1