Reaction Details
TargetCystic fibrosis transmembrane conductance regulator
LigandBDBM300426
Substrate/Competitorn/a
Meas. Tech.YFP-Halide Influx Assay for the CFTR-WT
IC50 40.0±n/a nM
Citation Akkari, RAlvey, LJBock, XMBrown, BSClaes, PICowart, MDConrath, KECyr, DDe Lemos, EDe Wilde, GJDesroy, NDuthion, BGfesser, GAGosmini, RLHousseman, CGJansen, KKJi, JKym, PRLefrancois, JMammoliti, OMenet, CJMerayo, NMNewsome, GJPalisse, AMPatel, SVPizzonero, MRShrestha, ASwift, ECTse, CVan der Plas, SEWang, X Compounds for treatment of cystic fibrosis US Patent US10130622 Publication Date 11/20/2018
 
Cystic fibrosis transmembrane conductance regulator
Name:Cystic fibrosis transmembrane conductance regulator
Type:Enzyme Catalytic Domain
Mol. Mass.:168171.30
Organism:Homo sapiens (Human)
Description:gi_90421313
Residue:1480
BDBM300426
NameBDBM300426
Synonyms:US10130622, Example 00005
TypeSmall organic molecule
Emp. Form.C26H34FN5O5S
Mol. Mass.547.642
SMILESCOCCS(=O)(=O)NC(=O)c1cc(N2CCC(COC)CC2)c2c(nn(-c3ccc(F)cc3)c2n1)C(C)C