Reaction Details
TargetFibroblast growth factor receptor 2
LigandBDBM161419
Substrate/Competitorn/a
Meas. Tech.Measurement of Inhibitory Effect on FGFR2 Kinase Activity
IC50 0.400±n/a nM
Citation Sootome, H Therapeutic agent for FGFR inhibitor-resistant cancer US Patent US10835536 Publication Date 11/17/2020
 
Fibroblast growth factor receptor 2
Name:Fibroblast growth factor receptor 2
Type:Enzyme
Mol. Mass.:92015.45
Organism:Homo sapiens (Human)
Description:P21802
Residue:821
BDBM161419
NameBDBM161419
Synonyms:US10124003, Ex. Compound 32 US10894048, Ex Comp 32 | US9108973, 32
TypeSmall organic molecule
Emp. Form.C24H22N6O3
Mol. Mass.442.4699
SMILESCOc1cc(OC)cc(c1)C#Cc1nn([C@H]2C[C@@H](C#C)N(C2)C(=O)C=C)c2ncnc(N)c12