Reaction Details
TargetSodium channel protein type 9 subunit alpha
LigandBDBM50237520
Substrate/Competitorn/a
Meas. Tech.Ligand Binding Assay (LBA)
IC50 21.0±n/a nM
Citation Wu, YGuernon, JM Acyl sulfonamide NaV1.7 inhibitors US Patent US10836758 Publication Date 11/17/2020
 
Sodium channel protein type 9 subunit alpha
Name:Sodium channel protein type 9 subunit alpha
Type:Protein
Mol. Mass.:226375.97
Organism:Homo sapiens (Human)
Description:Q15858
Residue:1988
BDBM50237520
NameBDBM50237520
Synonyms:CHEMBL4088581 | US10836758, Example 3
TypeSmall organic molecule
Emp. Form.C15H19ClFN5O2S2
Mol. Mass.419.925
SMILESFc1cc(NCCC2CCCCN2)c(Cl)cc1S(=O)(=O)Nc1ncns1