Reaction Details
TargetMitogen-activated protein kinase 3
LigandBDBM473172
Substrate/Competitorn/a
Meas. Tech.Kinase Assay
Kd 5500±n/a nM
Citation Mansour, TSEvans, CE 1,2-dithiolane compounds useful in neuroprotection, autoimmune and cancer diseases and conditions US Patent US10844038 Publication Date 11/24/2020
 
Mitogen-activated protein kinase 3
Name:Mitogen-activated protein kinase 3
Type:Protein
Mol. Mass.:43136.58
Organism:Homo sapiens (Human)
Description:curated by PDB 4QTB
Residue:379
BDBM473172
NameBDBM473172
Synonyms:(3R,4R)-3-((4-amino-3-(4-phenoxyphenyl)-1H-pyrazolo[3,4-d]pyrimidin-1-yl)methyl)-1,2-dithiolan-4-ol | US10844038, Example 46 B.
TypeSmall organic molecule
Emp. Form.C21H19N5O2S2
Mol. Mass.437.538
SMILESNc1ncnc2n(C[C@H]3SSC[C@H]3O)nc(-c3ccc(Oc4ccccc4)cc3)c12