Reaction Details
TargetUDP-3-O-acyl-N-acetylglucosamine deacetylase
LigandBDBM50200120
Substrate/Competitorn/a
Meas. Tech.nhibition Assay against Klebsiella pneumoniae LpxC
IC50<1±0 nM
Citation Teng, MNammalwar, BTaganov, KPuerta, DT Substituted pyrimidines for treating bacterial infections US Patent US10875832 Publication Date 12/29/2020
 
UDP-3-O-acyl-N-acetylglucosamine deacetylase
Name:UDP-3-O-acyl-N-acetylglucosamine deacetylase
Type:Protein
Mol. Mass.:34042.19
Organism:n/a
Description:A6T4N9
Residue:305
 
BDBM50200120
NameBDBM50200120
Synonyms:CHEMBL260091 US10875832, Compound ChIR-090
TypeSmall organic molecule
Emp. Form.C24H27N3O5
Mol. Mass.437.4883
SMILESC[C@@H](O)[C@H](NC(=O)c1ccc(cc1)C#Cc1ccc(CN2CCOCC2)cc1)C(=O)NO