Reaction Details
TargetCoagulation factor XI
LigandBDBM238254
Substrate/Competitorn/a
Meas. Tech.In Vitro Assay
IC50 78.0±n/a nM
Citation Imagawa, AKondo, TNishiyama, TCourtney, SYarnold, CIchihara, OFlanagan, S Substituted pyrrolidines as factor XIa inhibitors for the treatment thromboembolic diseases US Patent US10882855 Publication Date 1/5/2021
 
Coagulation factor XI
Name:Coagulation factor XI
Type:Enzyme
Mol. Mass.:70130.58
Organism:Homo sapiens (Human)
Description:P03951
Residue:625
BDBM238254
NameBDBM238254
Synonyms:US10882855, Example 39 US9585881, Example 39
TypeSmall organic molecule
Emp. Form.C31H31ClN8O4S
Mol. Mass.647.147
SMILESClc1ccc(c(\C=C\C(=O)N2C[C@H](C[C@H]2C(=O)Nc2ccccc2)N2CCN(CC2)S(=O)(=O)c2ccccc2)c1)-n1cnnn1