Reaction Details
TargetFibroblast growth factor receptor 2
LigandBDBM161396
Substrate/Competitorn/a
Meas. Tech.Measurement of Inhibitory Effect on FGFR2 Kinase Activity
IC50<0.300±n/a nM
Citation Ochiiwa, HHirai, H Antitumor drug for intermittent administration of FGFR inhibitor US Patent US10894048 Publication Date 1/19/2021
 
Fibroblast growth factor receptor 2
Name:Fibroblast growth factor receptor 2
Type:Enzyme
Mol. Mass.:92015.45
Organism:Homo sapiens (Human)
Description:P21802
Residue:821
BDBM161396
NameBDBM161396
Synonyms:US10124003, Ex. Compound 9 US10894048, Ex Comp 51 | US9108973, 9
TypeSmall organic molecule
Emp. Form.C21H20N6O3
Mol. Mass.404.4219
SMILESCOc1cc(OC)cc(c1)C#Cc1nn(C2CN(C2)C(=O)C=C)c2ncnc(N)c12