Reaction Details
TargetFibroblast growth factor receptor 2
LigandBDBM478146
Substrate/Competitorn/a
Meas. Tech.Measurement of Inhibitory Effect on FGFR2 Kinase Activity
IC50<0.300±n/a nM
Citation Ochiiwa, HHirai, H Antitumor drug for intermittent administration of FGFR inhibitor US Patent US10894048 Publication Date 1/19/2021
 
Fibroblast growth factor receptor 2
Name:Fibroblast growth factor receptor 2
Type:Enzyme
Mol. Mass.:92015.45
Organism:Homo sapiens (Human)
Description:P21802
Residue:821
BDBM478146
NameBDBM478146
Synonyms:US10894048, Ex Comp 66
TypeSmall organic molecule
Emp. Form.C24H24N6O5
Mol. Mass.476.4846
SMILESCOC(=O)[C@@H]1C[C@@H](CN1C(=O)C=C)n1nc(C#Cc2cc(OC)cc(OC)c2)c2c(N)ncnc12