Reaction Details
TargetLysine-specific histone demethylase 1A
LigandBDBM301085
Substrate/Competitorn/a
Meas. Tech.In Vitro Enzyme Inhibition Assay - LSD-1
IC50<10±n/a nM
Citation Chen, YKKanouni, TKaldor, SWStafford, JAVeal, JM Inhibitors of lysine specific demethylase-1 US Patent US10131664 Publication Date 11/20/2018
 
Lysine-specific histone demethylase 1A
Name:Lysine-specific histone demethylase 1A
Type:Enzyme
Mol. Mass.:92901.01
Organism:Homo sapiens (Human)
Description:O60341
Residue:852
BDBM301085
NameBDBM301085
Synonyms:4-[2-(4-aminopiperidin-1-yl)-5-[1- (oxolan-3-ylmethyl)pyrazol-4- yl]pyrimidin-4-yl]benzonitrile | US10131664, Example 78
TypeSmall organic molecule
Emp. Form.C24H27N7O
Mol. Mass.429.5175
SMILESNC1CCN(CC1)c1ncc(-c2cnn(CC3CCOC3)c2)c(n1)-c1ccc(cc1)C#N