Reaction Details
TargetLysine-specific histone demethylase 1A
LigandBDBM301097
Substrate/Competitorn/a
Meas. Tech.In Vitro Enzyme Inhibition Assay - LSD-1
IC50<10±n/a nM
Citation Chen, YKKanouni, TKaldor, SWStafford, JAVeal, JM Inhibitors of lysine specific demethylase-1 US Patent US10131664 Publication Date 11/20/2018
 
Lysine-specific histone demethylase 1A
Name:Lysine-specific histone demethylase 1A
Type:Enzyme
Mol. Mass.:92901.01
Organism:Homo sapiens (Human)
Description:O60341
Residue:852
BDBM301097
NameBDBM301097
Synonyms:4-[2-(4-aminopiperidin-1-yl)-5-(2- methylpyrimidin-5-yl)pyrimidin-4- yl]benzonitrile | US10131664, Example 90
TypeSmall organic molecule
Emp. Form.C21H21N7
Mol. Mass.371.4383
SMILESCc1ncc(cn1)-c1cnc(nc1-c1ccc(cc1)C#N)N1CCC(N)CC1