Reaction Details
TargetEndothelin-1
LigandBDBM168442
Substrate/Competitorn/a
Meas. Tech.ET-1 Assay
EC50>200000±n/a nM
Citation PubChem, PCBuckman, BONicholas, JBRamphal, JYEmayan, KSeiwert, SD Anti-fibrotic pyridinones US Patent US9675593 Publication Date 6/13/2017
 
Endothelin-1
Name:Endothelin-1
Type:Protein
Mol. Mass.:24444.51
Organism:Homo sapiens (Human)
Description:P05305
Residue:212
BDBM168442
NameBDBM168442
Synonyms:US9675593, 15
TypeSmall organic molecule
Emp. Form.C13H10FNO2
Mol. Mass.231.2224
SMILESCC(=O)c1ccc(=O)n(c1)-c1cccc(F)c1