Reaction Details
TargetEndothelin-1
LigandBDBM168493
Substrate/Competitorn/a
Meas. Tech.ET-1 Assay
EC50>200000±n/a nM
Citation PubChem, PCBuckman, BONicholas, JBRamphal, JYEmayan, KSeiwert, SD Anti-fibrotic pyridinones US Patent US9675593 Publication Date 6/13/2017
 
Endothelin-1
Name:Endothelin-1
Type:Protein
Mol. Mass.:24444.51
Organism:Homo sapiens (Human)
Description:P05305
Residue:212
BDBM168493
NameBDBM168493
Synonyms:US9675593, 55
TypeSmall organic molecule
Emp. Form.C24H18F3N5O2
Mol. Mass.465.4272
SMILESCn1cc(cn1)-c1cn(-c2ccc(OC(F)(F)F)cc2)c(=O)c2ncn(Cc3ccccc3)c12