Reaction Details
TargetEndothelin-1
LigandBDBM172586
Substrate/Competitorn/a
Meas. Tech.ET-1 Assay
EC50<50000±n/a nM
Citation PubChem, PCBuckman, BONicholas, JBRamphal, JYEmayan, KSeiwert, SD Anti-fibrotic pyridinones US Patent US9675593 Publication Date 6/13/2017
 
Endothelin-1
Name:Endothelin-1
Type:Protein
Mol. Mass.:24444.51
Organism:Homo sapiens (Human)
Description:P05305
Residue:212
BDBM172586
NameBDBM172586
Synonyms:US9675593, 657
TypeSmall organic molecule
Emp. Form.C19H16F3N5O2
Mol. Mass.403.3578
SMILESCCn1cc2c(cn(-c3ccc(OC(F)(F)F)cc3)c(=O)c2n1)-c1cnn(C)c1