Reaction Details
TargetEndothelin-1
LigandBDBM172592
Substrate/Competitorn/a
Meas. Tech.ET-1 Assay
EC50<50000±n/a nM
Citation PubChem, PCBuckman, BONicholas, JBRamphal, JYEmayan, KSeiwert, SD Anti-fibrotic pyridinones US Patent US9675593 Publication Date 6/13/2017
 
Endothelin-1
Name:Endothelin-1
Type:Protein
Mol. Mass.:24444.51
Organism:Homo sapiens (Human)
Description:P05305
Residue:212
BDBM172592
NameBDBM172592
Synonyms:US9675593, 670
TypeSmall organic molecule
Emp. Form.C20H18F3N5O2
Mol. Mass.417.3844
SMILESCCn1cc(cn1)-c1cn(-c2ccc(OC(F)(F)F)cc2)c(=O)c2n(CC)cnc12