Reaction Details
TargetEndothelin-1
LigandBDBM172782
Substrate/Competitorn/a
Meas. Tech.ET-1 Assay
EC50<50000±n/a nM
Citation PubChem, PCBuckman, BONicholas, JBRamphal, JYEmayan, KSeiwert, SD Anti-fibrotic pyridinones US Patent US9675593 Publication Date 6/13/2017
 
Endothelin-1
Name:Endothelin-1
Type:Protein
Mol. Mass.:24444.51
Organism:Homo sapiens (Human)
Description:P05305
Residue:212
BDBM172782
NameBDBM172782
Synonyms:US9675593, 683
TypeSmall organic molecule
Emp. Form.C20H14F4N4O2
Mol. Mass.418.3444
SMILESCCn1nnc2c(cn(-c3ccc(OC(F)(F)F)cc3)c(=O)c12)-c1ccc(F)cc1